TEST FAILED failure expression: failexpr:
TEST FAILED failure reason: lastevent or _event aren't stringsfail TEST FAILED failure expression: failexpr: TEST FAILED failure reason: block following subdialogfail