TEST FAILED failure expression: failexpr:
TEST FAILED failure reason: Wrong assignment to scrvardoc variable!fail TEST FAILED failure reason: Wrong assignment to scrvardial variable!fail TEST FAILED failure reason: Wrong assignment to scrvaranon variable!fail