TEST FAILED failure expression: failexpr:
First value assigned in document order TEST FAILED failure reason: error on document order evaluation on first var declarationfail Second value assigned in document order TEST FAILED failure reason: error on document order evaluation on second var declaration fail Third value assigned in document order TEST PASSED pass