TEST FAILED failure expression: failexpr:
chicago Say something unrecognizable . Say something unrecognizable again . Say something unrecognizable one more time . TEST PASSED pass TEST FAILED failure expression: failexpr: TEST FAILED failure reason: caught 3 noinputs; broken driverfail