TEST FAILED failure expression: failexpr:
TEST PASSED pass TEST FAILED failure reason: missed earlier handlerfail TEST FAILED failure expression: failexpr: TEST FAILED failure reason: blockfail