TEST FAILED failure expression: failexpr:
TEST FAILED failure reason: Session predefined variable is not presentfail TEST FAILED failure reason: Application predefined variable is not presentfail TEST FAILED failure reason: Document predefined variable is not presentfail TEST FAILED failure reason: Dialog predefined variable is not presentfail