TEST FAILED failure expression: failexpr:
TEST FAILED failure reason: blockScopeVar must be inaccessible out of its block scopefail TEST FAILED failure reason: catchScopeVar must be inaccessible out of its catch scopefail TEST PASSED pass Say 'new york'. Say 'new york' again. Say 'new york' one more time. new york