TEST FAILED failure expression: failexpr:
TEST FAILED failure reason: Dialog scope script myFactorial hasn't been correctly definedfail TEST FAILED failure reason: Dialog scope variable formVar1 hasn't been correctly definedfail TEST FAILED failure reason: Dialog scope variable formVar1 hasn't been correctly initializedfail
TEST FAILED failure reason: Dialog scope script myFactorial is still accessible when another dialog is enteredfail TEST FAILED failure reason: Dialog scope variable formVar1 is still accessible when another dialog is enteredfail TEST FAILED failure reason: Dialog scope script myPower hasn't been correctly definedfail TEST FAILED failure reason: Dialog scope variable formVar2 hasn't been correctly definedfail TEST FAILED failure reason: Dialog scope variable formVar2 hasn't been correctly initializedfail