TEST FAILED failure expression: failexpr:
TEST FAILED failure reason: Document scope script myFactorial hasn't been correctly definedfail TEST FAILED failure reason: Document scope variable docVar1 hasn't been correctly definedfail TEST FAILED failure reason: Document scope variable docVar1 hasn't been correctly initializedfail