TEST FAILED failure expression: failexpr:
TEST FAILED failure reason: CATCH scope script hasn't been well definedfail TEST FAILED failure reason: FORM scope script hasn't been well definedfail TEST FAILED failure reason: VXML scope script hasn't been well definedfail TEST FAILED failure reason: BLOCK scope script hasn't been well definedfail Say 'london'. Say 'london' again. Say 'london' one more time. london TEST FAILED failure reason: FILLED scope script hasn't been well defined fail No input expected. Say nothing . No input expected. Say nothing again . No input expected. Say nothing one more time . chicago