TEST PASSED pass TEST FAILED failure expression: failexpr:
TEST FAILED failure reason: Should never reach this point.fail TEST FAILED failure reason: block after blind transferfail