TEST PASSED pass TEST FAILED failure expression: failexpr:
TEST FAILED failure reason: filled on blind xferfail TEST FAILED failure reason: blockfail