TEST FAILED failure reason: error event not thrown for unsupported objectfail caught TEST PASSED pass TEST FAILED failure expression: failexpr: