TEST FAILED failure expression: failexpr:
chicagoSWI_literal="beta" Say 'chicago'. Say 'chicago' again. Say 'chicago' one more time. TEST FAILED failure reason: lastresult$ is not an objectfail TEST FAILED failure expression: failexpr: